1. Давно не виделись, Гость ! :)
    Скрыть объявление

Ragnarok Online 2 Sources

Тема в разделе "Ragnarok Online 2: The Gate of the World", создана пользователем Sam3000, 18 июл 2014.

  1. Sam3000

    Sam3000 Свой

    Регистрация:
    22.03.2009
    Сообщения:
    1.276
    Симпатии:
    297
    Баллы:
    123
    Best Answers:
    0
    MAXLviv нравится это.
  2. Aminako

    Aminako В теме

    Регистрация:
    12.03.2010
    Сообщения:
    11
    Симпатии:
    0
    Баллы:
    31
    Best Answers:
    0
    Обе ссылки содержат одни и те же клиенты :-р
    во второй ссылке нет сервера, но есть файл с изображениями на 99 метров. плюс собственные (того кто выложил) настройки компиляции проекта.

    В остальном клиент один.

    Скачала сейчас буду пробовать собрать все это добро :-)
    Потом отпишусь что вышло.


    Попробовала.
    На прямую не компилится. 21 файл с ошибками и 7 скомпилировались.
     
    Последнее редактирование: 27 июл 2014
  3. Sam3000

    Sam3000 Свой

    Регистрация:
    22.03.2009
    Сообщения:
    1.276
    Симпатии:
    297
    Баллы:
    123
    Best Answers:
    0
    Ошибочки выложи, попробуемся починить, я бы сам скомпилил, но чет занят был.
     
  4. geralex

    geralex Свой

    Регистрация:
    30.03.2009
    Сообщения:
    53
    Симпатии:
    2
    Баллы:
    38
    Best Answers:
    0
    Там проблема в отсутствующем файле, писал на раге, но не помогли=(

    Error 1 fatal error C1083: Cannot open include file: 'EngineClasses.h': No such file or directory \src\Engine\Inc\Engine.h
     
  5. Sam3000

    Sam3000 Свой

    Регистрация:
    22.03.2009
    Сообщения:
    1.276
    Симпатии:
    297
    Баллы:
    123
    Best Answers:
    0
    А там ответ кстати есть. Это файл из unreal engine'а, надо правильно SDK подключить, чтоб скомпилить.

    Если все равно хочется и я найду время на неделе, я соберу и гайдик напишу (на выходных может время будет). А так, у кого ошибки есть, пишите, я расскажу че как )
     
  6. geralex

    geralex Свой

    Регистрация:
    30.03.2009
    Сообщения:
    53
    Симпатии:
    2
    Баллы:
    38
    Best Answers:
    0
    Вот UE 2.5 нету =(
     
    Последнее редактирование: 2 авг 2014
  7. Aminako

    Aminako В теме

    Регистрация:
    12.03.2010
    Сообщения:
    11
    Симпатии:
    0
    Баллы:
    31
    Best Answers:
    0
    Ладно бы там только одного файла не хватало... Но у меня такое впечатление что компилить нужно не в VS2005, как там сказано, а в чем-то другом.

    Код (C (Unknown Language)):
    1. 1>?? Build started: Project: ExportMFCUI, Configuration: Debug Win32 ??
    2. 2>?? Build started: Project: !BuildAll, Configuration: Debug_Off Win32 ??
    3. 3>?? Build started: Project: Core, Configuration: Debug_Off Win32 ??
    4. 4>?? Build started: Project: DLL_Loading, Configuration: Debug Win32 ??
    5. 2>Performing Makefile project actions
    6. 2>"..\System\UccDepend.exe" не является внутренней или внешней
    7. 1>Compiling...
    8. 2>командой, исполняемой программой или пакетным файлом.
    9. 2>Project : error PRJ0019: A tool returned an error code from "Performing Makefile project actions"
    10. 2>Build log was saved at "file://c:\games\ro2\rag2src\rag2src\Output\Debug_Off\!BuildAll\BuildLog.htm"
    11. 2>!BuildAll - 1 error(s), 0 warning(s)
    12. 4>Compiling...
    13. 5>?? Build started: Project: UWindow, Configuration: Debug_Off Win32 ??
    14. 5>There is no build command line to execute.
    15. 5>
    16. 5>Performing Makefile project actions
    17. 5>Build log was saved at "file://c:\games\ro2\rag2src\rag2src\Output\Debug_Off\UWindow\BuildLog.htm"
    18. 5>UWindow - 0 error(s), 0 warning(s)
    19. 3>Compiling...
    20. 6>?? Build started: Project: UDebugMenu, Configuration: Debug_Off Win32 ??
    21. 6>There is no build command line to execute.
    22. 6>
    23. 6>Performing Makefile project actions
    24. 6>Build log was saved at "file://c:\games\ro2\rag2src\rag2src\Output\Debug_Off\UDebugMenu\BuildLog.htm"
    25. 6>UDebugMenu - 0 error(s), 0 warning(s)
    26. 7>?? Build started: Project: EffectE, Configuration: Debug Win32 ??
    27. 7>There is no build command line to execute.
    28. 7>
    29. 7>Performing Makefile project actions
    30. 1>stdafx.cpp
    31. 4>DLL_Head.cpp
    32. 3>UnVcWin32.cpp
    33. 7>Build log was saved at "file://c:\games\ro2\rag2src\rag2src\Output\Debug\EffectE\BuildLog.htm"
    34. 7>EffectE - 0 error(s), 0 warning(s)
    35. 1>c:\games\ro2\rag2src\rag2src\src\exportmfcui\stdafx.h(31) : fatal error C1083: Cannot open include file: 'afxwin.h': No such file or directory
    36. 1>Build log was saved at "file://c:\games\ro2\rag2src\rag2src\src\ExportMFCUI\Debug\BuildLog.htm"
    37. 1>ExportMFCUI - 1 error(s), 0 warning(s)
    38. 8>?? Build started: Project: Rag2Game, Configuration: Debug_Off Win32 ??
    39. 8>There is no build command line to execute.
    40. 8>
    41. 8>Performing Makefile project actions
    42. 8>Build log was saved at "file://c:\games\ro2\rag2src\rag2src\Output\Debug_Off\Rag2Game\BuildLog.htm"
    43. 8>Rag2Game - 0 error(s), 0 warning(s)
    44. 9>?? Build started: Project: IniCrypt, Configuration: Debug Win32 ??
    45. 9>Compiling...
    46. 9>main.cpp
    47. 3>c:\games\ro2\rag2src\rag2src\src\core\src\unvcwin32.cpp(18) : fatal error C1083: Cannot open include file: 'windows.h': No such file or directory
    48. 4>c:\games\ro2\rag2src\rag2src\lib\directx9\inc\d3d9.h(40) : fatal error C1083: Cannot open include file: 'objbase.h': No such file or directory
    49. 4>Rag2DirectShow.cpp
    50. 3>Rag2AsyncLoad.cpp
    51. 3>c:\games\ro2\rag2src\rag2src\src\core\rag2src\rag2asyncload.cpp(1) : fatal error C1083: Cannot open include file: 'windows.h': No such file or directory
    52. 3>Rag2Crypt.cpp
    53. 3>c:\games\ro2\rag2src\rag2src\src\core\rag2src\rag2crypt.cpp(1) : fatal error C1083: Cannot open include file: 'windows.h': No such file or directory
    54. 3>Rag2FilePack.cpp
    55. 3>c:\games\ro2\rag2src\rag2src\src\core\rag2src\rag2filepack.cpp(1) : fatal error C1083: Cannot open include file: 'windows.h': No such file or directory
    56. 3>Rag2FileStream.cpp
    57. 3>c:\games\ro2\rag2src\rag2src\src\core\rag2src\rag2filestream.cpp(2) : fatal error C1083: Cannot open include file: 'windows.h': No such file or directory
    58. 3>Rag2FolderPack.cpp
    59. 10>?? Build started: Project: Gameplay, Configuration: Debug_Off Win32 ??
    60. 10>There is no build command line to execute.
    61. 10>
    62. 10>Performing Makefile project actions
    63. 4>c:\games\ro2\rag2src\rag2src\lib\directx9\inc\d3d9.h(40) : fatal error C1083: Cannot open include file: 'objbase.h': No such file or directory
    64. 4>Rag2Lock.cpp
    65. 10>Build log was saved at "file://c:\games\ro2\rag2src\rag2src\Output\Debug_Off\Gameplay\BuildLog.htm"
    66. 10>Gameplay - 0 error(s), 0 warning(s)
    67. 3>c:\games\ro2\rag2src\rag2src\src\core\rag2src\rag2folderpack.cpp(2) : fatal error C1083: Cannot open include file: 'windows.h': No such file or directory
    68. 3>Rag2Path.cpp
    69. 4>c:\games\ro2\rag2src\rag2src\lib\directx9\inc\d3d9.h(40) : fatal error C1083: Cannot open include file: 'objbase.h': No such file or directory
    70. 4>Rag2MovieTexture.cpp
    71. 3>c:\games\ro2\rag2src\rag2src\src\core\rag2src\rag2path.cpp(1) : fatal error C1083: Cannot open include file: 'windows.h': No such file or directory
    72. 3>Rag2Thread.cpp
    73. 4>c:\games\ro2\rag2src\rag2src\lib\directx9\inc\d3d9.h(40) : fatal error C1083: Cannot open include file: 'objbase.h': No such file or directory
    74. 3>c:\games\ro2\rag2src\rag2src\src\core\rag2src\rag2thread.cpp(2) : fatal error C1083: Cannot open include file: 'windows.h': No such file or directory
    75. 4>Generating Code...
    76. 3>UnVcWin32.cpp
    77. 4>Build log was saved at "file://c:\games\ro2\rag2src\rag2src\Output\Debug\DLL_Loading\BuildLog.htm"
    78. 4>DLL_Loading - 4 error(s), 0 warning(s)
    79. 11>?? Build started: Project: EffectC, Configuration: Debug Win32 ??
    80. 11>There is no build command line to execute.
    81. 11>
    82. 11>Performing Makefile project actions
    83. 3>c:\games\ro2\rag2src\rag2src\src\core\src\unvcwin32.cpp(18) : fatal error C1083: Cannot open include file: 'windows.h': No such file or directory
    84. 3>Rag2AsyncLoad.cpp
    85. 11>Build log was saved at "file://c:\games\ro2\rag2src\rag2src\Output\Debug\EffectC\BuildLog.htm"
    86. 11>EffectC - 0 error(s), 0 warning(s)
    87. 3>c:\games\ro2\rag2src\rag2src\src\core\rag2src\rag2asyncload.cpp(1) : fatal error C1083: Cannot open include file: 'windows.h': No such file or directory
    88. 12>?? Build started: Project: Decoration, Configuration: Debug_Japan Win32 ??
    89. 3>Rag2Crypt.cpp
    90. 12>There is no build command line to execute.
    91. 12>
    92. 12>Performing Makefile project actions
    93. 12>Build log was saved at "file://c:\games\ro2\rag2src\rag2src\Output\Debug_Japan\Decoration\BuildLog.htm"
    94. 12>Decoration - 0 error(s), 0 warning(s)
    95. 3>c:\games\ro2\rag2src\rag2src\src\core\rag2src\rag2crypt.cpp(1) : fatal error C1083: Cannot open include file: 'windows.h': No such file or directory
    96. 3>Rag2FilePack.cpp
    97. 3>c:\games\ro2\rag2src\rag2src\src\core\rag2src\rag2filepack.cpp(1) : fatal error C1083: Cannot open include file: 'windows.h': No such file or directory
    98. 3>Rag2FileStream.cpp
    99. 13>?? Build started: Project: Rag2GameDataConverter, Configuration: Debug Win32 ??
    100. 3>c:\games\ro2\rag2src\rag2src\src\core\rag2src\rag2filestream.cpp(2) : fatal error C1083: Cannot open include file: 'windows.h': No such file or directory
    101. 3>Rag2FolderPack.cpp
    102. 3>c:\games\ro2\rag2src\rag2src\src\core\rag2src\rag2folderpack.cpp(2) : fatal error C1083: Cannot open include file: 'windows.h': No such file or directory
    103. 3>Rag2Path.cpp
    104. 3>c:\games\ro2\rag2src\rag2src\src\core\rag2src\rag2path.cpp(1) : fatal error C1083: Cannot open include file: 'windows.h': No such file or directory
    105. 3>Rag2Thread.cpp
    106. 3>c:\games\ro2\rag2src\rag2src\src\core\rag2src\rag2thread.cpp(2) : fatal error C1083: Cannot open include file: 'windows.h': No such file or directory
    107. 3>Generating Code...
    108. 3>Creating browse information file...
    109. 13>Compiling...
    110. 13>stdafx.cpp
    111. 13>c:\games\ro2\rag2src\rag2src\src\rag2gamedataconverter\stdafx.h(35) : fatal error C1083: Cannot open include file: 'afxwin.h': No such file or directory
    112. 13>Build log was saved at "file://c:\games\ro2\rag2src\rag2src\Output\Debug\Rag2GameDataConverter\BuildLog.htm"
    113. 13>Rag2GameDataConverter - 1 error(s), 0 warning(s)
    114. 9>c:\games\ro2\rag2src\rag2src\src\inicrypt\main.cpp(3) : fatal error C1083: Cannot open include file: 'windows.h': No such file or directory
    115. 9>Build log was saved at "file://c:\games\ro2\rag2src\rag2src\Output\Debug\IniCrypt\BuildLog.htm"
    116. 9>IniCrypt - 1 error(s), 0 warning(s)
    117. 3>Microsoft Browse Information Maintenance Utility Version 8.00.50727
    118. 3>Copyright © Microsoft Corporation. All rights reserved.
    119. 3>BSCMAKE: error BK1506 : cannot open file '..\..\..\Output\Debug_Off\Core\UnVcWin32.sbr': No such file or directory
    120. 3>Build log was saved at "file://c:\games\ro2\rag2src\rag2src\Output\Debug_Off\Core\BuildLog.htm"
    121. 3>Core - 17 error(s), 0 warning(s)
    122. 14>?? Build started: Project: Engine, Configuration: Debug_Off Win32 ??
    123. 15>?? Build started: Project: UccDepend, Configuration: Debug_Off Win32 ??
    124. 15>Compiling...
    125. 15>UccDepend.cpp
    126. 15>c:\games\ro2\rag2src\rag2src\src\uccdepend\source\uccdepend.cpp(10) : fatal error C1083: Cannot open include file: 'windows.h': No such file or directory
    127. 15>Build log was saved at "file://c:\games\ro2\rag2src\rag2src\Output\Debug_Off\UccDepend\BuildLog.htm"
    128. 15>UccDepend - 1 error(s), 0 warning(s)
    129. 14>Compiling...
    130. 14>AFileLog.cpp
    131. 14>c:\games\ro2\rag2src\rag2src\src\engine\rag2net\netclientsock.h(4) : fatal error C1083: Cannot open include file: 'winsock2.h': No such file or directory
    132. 14>Creating browse information file...
    133. 14>Microsoft Browse Information Maintenance Utility Version 8.00.50727
    134. 14>Copyright © Microsoft Corporation. All rights reserved.
    135. 14>BSCMAKE: error BK1506 : cannot open file '..\..\..\Output\Debug_Off\Engine\AFileLog.sbr': No such file or directory
    136. 14>Build log was saved at "file://c:\games\ro2\rag2src\rag2src\Output\Debug_Off\Engine\BuildLog.htm"
    137. 14>Engine - 2 error(s), 0 warning(s)
    138. 16>?? Build started: Project: Window, Configuration: Debug_Off Win32 ??
    139. 17>?? Build started: Project: ALAudio, Configuration: Debug Win32 ??
    140. 18>?? Build started: Project: Fire, Configuration: Debug_Off Win32 ??
    141. 19>?? Build started: Project: D3D9Drv, Configuration: Debug_AMD64 Win32 ??
    142. 18>Compiling...
    143. 17>Compiling...
    144. 18>UnFractal.cpp
    145. 16>Compiling...
    146. 17>ALAudio.cpp
    147. 19>Compiling...
    148. 16>Window.cpp
    149. 19>D3D9Drv.cpp
    150. 19>c:\games\ro2\rag2src\rag2src\src\d3d9drv\src\D3D9Drv.h(39) : fatal error C1083: Cannot open include file: 'windows.h': No such file or directory
    151. 17>c:\games\ro2\rag2src\rag2src\src\alaudio\inc\alaudio.h(26) : fatal error C1083: Cannot open include file: 'windows.h': No such file or directory
    152. 17>ALAudioEAXTools.cpp
    153. 19>Creating browse information file...
    154. 16>c:\games\ro2\rag2src\rag2src\src\window\src\window.cpp(11) : fatal error C1083: Cannot open include file: 'windows.h': No such file or directory
    155. 16>Build log was saved at "file://c:\games\ro2\rag2src\rag2src\Output\Debug_Off\Window\BuildLog.htm"
    156. 16>Window - 1 error(s), 0 warning(s)
    157. 19>Microsoft Browse Information Maintenance Utility Version 8.00.50727
    158. 17>c:\games\ro2\rag2src\rag2src\src\alaudio\inc\alaudio.h(26) : fatal error C1083: Cannot open include file: 'windows.h': No such file or directory
    159. 19>Copyright © Microsoft Corporation. All rights reserved.
    160. 17>ALAudioSubsystem.cpp
    161. 19>BSCMAKE: error BK1506 : cannot open file '..\..\..\Output\Debug_AMD64\D3D9Drv\CImageSurface.sbr': No such file or directory
    162. 19>Build log was saved at "file://c:\games\ro2\rag2src\rag2src\Output\Debug_AMD64\D3D9Drv\BuildLog.htm"
    163. 19>D3D9Drv - 2 error(s), 0 warning(s)
    164. 17>c:\games\ro2\rag2src\rag2src\src\alaudio\inc\alaudio.h(26) : fatal error C1083: Cannot open include file: 'windows.h': No such file or directory
    165. 17>AudioEventManager.cpp
    166. 17>c:\games\ro2\rag2src\rag2src\src\alaudio\inc\alaudio.h(26) : fatal error C1083: Cannot open include file: 'windows.h': No such file or directory
    167. 17>OpenALSource.cpp
    168. 20>?? Build started: Project: Editor, Configuration: Debug_Off Win32 ??
    169. 17>c:\games\ro2\rag2src\rag2src\src\alaudio\inc\alaudio.h(26) : fatal error C1083: Cannot open include file: 'windows.h': No such file or directory
    170. 17>OpenALSubsystem.cpp
    171. 17>c:\games\ro2\rag2src\rag2src\src\alaudio\inc\alaudio.h(26) : fatal error C1083: Cannot open include file: 'windows.h': No such file or directory
    172. 17>Generating Code...
    173. 17>Creating browse information file...
    174. 17>Microsoft Browse Information Maintenance Utility Version 8.00.50727
    175. 17>Copyright © Microsoft Corporation. All rights reserved.
    176. 17>BSCMAKE: error BK1506 : cannot open file '..\..\..\Output\Debug\ALAudio\ALAudioEAXTools.sbr': No such file or directory
    177. 17>Build log was saved at "file://c:\games\ro2\rag2src\rag2src\Output\Debug\ALAudio\BuildLog.htm"
    178. 17>ALAudio - 7 error(s), 0 warning(s)
    179. 21>?? Build started: Project: WinDrv, Configuration: Debug_Off Win32 ??
    180. 20>Compiling...
    181. 20>Editor.cpp
    182. 20>c:\games\ro2\rag2src\rag2src\src\editor\src\editorprivate.h(71) : fatal error C1083: Cannot open include file: 'windows.h': No such file or directory
    183. 20>Build log was saved at "file://c:\games\ro2\rag2src\rag2src\Output\Debug_Off\Editor\BuildLog.htm"
    184. 20>Editor - 1 error(s), 0 warning(s)
    185. 22>?? Build started: Project: Setup, Configuration: Debug_Off Win32 ??
    186. 21>Compiling...
    187. 21>WinDrv.cpp
    188. 21>c:\games\ro2\rag2src\rag2src\src\windrv\inc\windrv.h(27) : fatal error C1083: Cannot open include file: 'windows.h': No such file or directory
    189. 21>WinDrv.cpp
    190. 21>c:\games\ro2\rag2src\rag2src\src\windrv\inc\windrv.h(27) : fatal error C1083: Cannot open include file: 'windows.h': No such file or directory
    191. 23>?? Build started: Project: UnrealEd, Configuration: Debug_Off Win32 ??
    192. 21>Creating browse information file...
    193. 21>Microsoft Browse Information Maintenance Utility Version 8.00.50727
    194. 21>Copyright © Microsoft Corporation. All rights reserved.
    195. 21>BSCMAKE: error BK1506 : cannot open file '..\..\..\Output\Debug_Off\WinDrv\WinDrv.sbr': No such file or directory
    196. 21>Build log was saved at "file://c:\games\ro2\rag2src\rag2src\Output\Debug_Off\WinDrv\BuildLog.htm"
    197. 21>WinDrv - 3 error(s), 0 warning(s)
    198. 22>Compiling...
    199. 22>Setup.cpp
    200. 22>c:\games\ro2\rag2src\rag2src\src\setup\src\setup.cpp(15) : fatal error C1083: Cannot open include file: 'windows.h': No such file or directory
    201. 22>USetupDefinitionWindows.cpp
    202. 22>c:\games\ro2\rag2src\rag2src\src\setup\src\usetupdefinitionwindows.cpp(11) : fatal error C1083: Cannot open include file: 'windows.h': No such file or directory
    203. 22>Generating Code...
    204. 22>Build log was saved at "file://c:\games\ro2\rag2src\rag2src\Output\Debug_Off\Setup\BuildLog.htm"
    205. 22>Setup - 2 error(s), 0 warning(s)
    206. 24>?? Build started: Project: Launch, Configuration: Debug_Off Win32 ??
    207. 24>Compiling...
    208. 24>Launch.cpp
    209. 25>?? Build started: Project: XmlCrypt, Configuration: Debug Win32 ??
    210. 24>c:\games\ro2\rag2src\rag2src\src\launch\src\launchprivate.h(11) : fatal error C1083: Cannot open include file: 'windows.h': No such file or directory
    211. 24>Creating browse information file...
    212. 24>Microsoft Browse Information Maintenance Utility Version 8.00.50727
    213. 24>Copyright © Microsoft Corporation. All rights reserved.
    214. 24>BSCMAKE: error BK1506 : cannot open file '..\..\..\Output\Debug_Off\Launch\Rag2Conf.sbr': No such file or directory
    215. 24>Build log was saved at "file://c:\games\ro2\rag2src\rag2src\Output\Debug_Off\Launch\BuildLog.htm"
    216. 24>Launch - 2 error(s), 0 warning(s)
    217. 25>Compiling...
    218. 23>Compiling...
    219. 25>stdafx.cpp
    220. 23>Browser.cpp
    221. 25>c:\games\ro2\rag2src\rag2src\src\xmlcrypt\src\stdafx.h(10) : fatal error C1083: Cannot open include file: 'windows.h': No such file or directory
    222. 25>Build log was saved at "file://c:\games\ro2\rag2src\rag2src\Output\Debug\XmlCrypt\BuildLog.htm"
    223. 25>XmlCrypt - 1 error(s), 0 warning(s)
    224. 26>?? Build started: Project: FolderPack, Configuration: Debug Win32 ??
    225. 23>c:\games\ro2\rag2src\rag2src\src\unrealed\inc\unrealed.h(21) : fatal error C1083: Cannot open include file: 'windows.h': No such file or directory
    226. 23>BrowserAnimation.cpp
    227. 23>c:\games\ro2\rag2src\rag2src\src\unrealed\inc\unrealed.h(21) : fatal error C1083: Cannot open include file: 'windows.h': No such file or directory
    228. 23>BrowserRag2Player.cpp
    229. 26>Compiling...
    230. 26>stdafx.cpp
    231. 23>c:\games\ro2\rag2src\rag2src\src\unrealed\inc\unrealed.h(21) : fatal error C1083: Cannot open include file: 'windows.h': No such file or directory
    232. 23>BuildPropSheet.cpp
    233. 26>c:\games\ro2\rag2src\rag2src\src\folderpack\src\stdafx.h(12) : fatal error C1083: Cannot open include file: 'windows.h': No such file or directory
    234. 26>Build log was saved at "file://c:\games\ro2\rag2src\rag2src\Output\Debug\FolderPack\BuildLog.htm"
    235. 26>FolderPack - 1 error(s), 0 warning(s)
    236. 23>c:\games\ro2\rag2src\rag2src\src\unrealed\inc\unrealed.h(21) : fatal error C1083: Cannot open include file: 'windows.h': No such file or directory
    237. 23>DlgBGMBrowser.cpp
    238. 27>?? Build started: Project: DebuggerLaunch, Configuration: Debug_Off Win32 ??
    239. 23>c:\games\ro2\rag2src\rag2src\src\unrealed\inc\unrealed.h(21) : fatal error C1083: Cannot open include file: 'windows.h': No such file or directory
    240. 23>DlgTexProp.cpp
    241. 23>c:\games\ro2\rag2src\rag2src\src\unrealed\inc\unrealed.h(21) : fatal error C1083: Cannot open include file: 'windows.h': No such file or directory
    242. 23>EdHook.cpp
    243. 23>c:\games\ro2\rag2src\rag2src\src\unrealed\src\edhook.cpp(13) : fatal error C1083: Cannot open include file: 'windows.h': No such file or directory
    244. 23>EdModes.cpp
    245. 23>c:\games\ro2\rag2src\rag2src\src\unrealed\inc\unrealed.h(21) : fatal error C1083: Cannot open include file: 'windows.h': No such file or directory
    246. 23>EmitterWizard.cpp
    247. 27>Compiling...
    248. 27>DebuggerLaunch.cpp
    249. 23>c:\games\ro2\rag2src\rag2src\src\unrealed\inc\unrealed.h(21) : fatal error C1083: Cannot open include file: 'windows.h': No such file or directory
    250. 23>GenericDlgOptions.cpp
    251. 27>c:\games\ro2\rag2src\rag2src\src\debuggerlaunch\inc\debuggerlaunchprivate.h(11) : fatal error C1083: Cannot open include file: 'windows.h': No such file or directory
    252. 27>UnDebuggerCore.cpp
    253. 23>c:\games\ro2\rag2src\rag2src\src\unrealed\inc\unrealed.h(21) : fatal error C1083: Cannot open include file: 'windows.h': No such file or directory
    254. 23>GeomFitUtils.cpp
    255. 27>c:\games\ro2\rag2src\rag2src\src\debuggerlaunch\inc\debuggerlaunchprivate.h(11) : fatal error C1083: Cannot open include file: 'windows.h': No such file or directory
    256. 27>UnDelphiInterface.cpp
    257. 23>c:\games\ro2\rag2src\rag2src\src\unrealed\inc\unrealed.h(21) : fatal error C1083: Cannot open include file: 'windows.h': No such file or directory
    258. 23>KarmaEditorSupport.cpp
    259. 23>c:\games\ro2\rag2src\rag2src\src\unrealed\inc\unrealed.h(21) : fatal error C1083: Cannot open include file: 'windows.h': No such file or directory
    260. 27>c:\games\ro2\rag2src\rag2src\src\debuggerlaunch\inc\debuggerlaunchprivate.h(11) : fatal error C1083: Cannot open include file: 'windows.h': No such file or directory
    261. 23>Main.cpp
    262. 27>Generating Code...
    263. 27>Creating browse information file...
    264. 27>Microsoft Browse Information Maintenance Utility Version 8.00.50727
    265. 27>Copyright © Microsoft Corporation. All rights reserved.
    266. 27>BSCMAKE: error BK1506 : cannot open file '..\..\..\Output\Debug_Off\DebuggerLaunch\UnDebuggerCore.sbr': No such file or directory
    267. 27>Build log was saved at "file://c:\games\ro2\rag2src\rag2src\Output\Debug_Off\DebuggerLaunch\BuildLog.htm"
    268. 27>DebuggerLaunch - 4 error(s), 0 warning(s)
    269. 28>?? Build started: Project: UCC, Configuration: Debug_Off Win32 ??
    270. 23>c:\games\ro2\rag2src\rag2src\src\unrealed\inc\unrealed.h(21) : fatal error C1083: Cannot open include file: 'windows.h': No such file or directory
    271. 23>ParticleEditor.cpp
    272. 23>c:\games\ro2\rag2src\rag2src\src\unrealed\inc\unrealed.h(21) : fatal error C1083: Cannot open include file: 'windows.h': No such file or directory
    273. 23>ParticleEditorComponent.cpp
    274. 28>Compiling...
    275. 23>c:\games\ro2\rag2src\rag2src\src\unrealed\inc\unrealed.h(21) : fatal error C1083: Cannot open include file: 'windows.h': No such file or directory
    276. 23>ParticleEditorControls.cpp
    277. 28>UCC.cpp
    278. 23>c:\games\ro2\rag2src\rag2src\src\unrealed\inc\unrealed.h(21) : fatal error C1083: Cannot open include file: 'windows.h': No such file or directory
    279. 23>ParticleEditorTab.cpp
    280. 28>c:\games\ro2\rag2src\rag2src\src\ucc\src\ucc.cpp(10) : fatal error C1083: Cannot open include file: 'windows.h': No such file or directory
    281. 28>Creating browse information file...
    282. 28>Microsoft Browse Information Maintenance Utility Version 8.00.50727
    283. 28>Copyright © Microsoft Corporation. All rights reserved.
    284. 28>BSCMAKE: error BK1506 : cannot open file '..\..\..\Output\Debug_Off\UCC\UCC.sbr': No such file or directory
    285. 28>Build log was saved at "file://c:\games\ro2\rag2src\rag2src\Output\Debug_Off\UCC\BuildLog.htm"
    286. 28>UCC - 2 error(s), 0 warning(s)
    287. 23>c:\games\ro2\rag2src\rag2src\src\unrealed\inc\unrealed.h(21) : fatal error C1083: Cannot open include file: 'windows.h': No such file or directory
    288. 23>ParticleEditorToolLabel.cpp
    289. 23>c:\games\ro2\rag2src\rag2src\src\unrealed\inc\unrealed.h(21) : fatal error C1083: Cannot open include file: 'windows.h': No such file or directory
    290. 23>ParticleEditorTools.cpp
    291. 23>c:\games\ro2\rag2src\rag2src\src\unrealed\inc\unrealed.h(21) : fatal error C1083: Cannot open include file: 'windows.h': No such file or directory
    292. 23>SurfacePropSheet.cpp
    293. 23>c:\games\ro2\rag2src\rag2src\src\unrealed\inc\unrealed.h(21) : fatal error C1083: Cannot open include file: 'windows.h': No such file or directory
    294. 23>Generating Code...
    295. 23>Compiling...
    296. 23>UnEdAct.cpp
    297. 23>c:\games\ro2\rag2src\rag2src\src\unrealed\inc\unrealed.h(21) : fatal error C1083: Cannot open include file: 'windows.h': No such file or directory
    298. 23>UnEdCam.cpp
    299. 23>c:\games\ro2\rag2src\rag2src\src\unrealed\inc\unrealed.h(21) : fatal error C1083: Cannot open include file: 'windows.h': No such file or directory
    300. 23>UnEdClick.cpp
    301. 23>c:\games\ro2\rag2src\rag2src\src\unrealed\inc\unrealed.h(21) : fatal error C1083: Cannot open include file: 'windows.h': No such file or directory
    302. 23>UnEdModeTools.cpp
    303. 23>c:\games\ro2\rag2src\rag2src\src\unrealed\inc\unrealed.h(21) : fatal error C1083: Cannot open include file: 'windows.h': No such file or directory
    304. 23>UnEdRend.cpp
    305. 23>c:\games\ro2\rag2src\rag2src\src\unrealed\inc\unrealed.h(21) : fatal error C1083: Cannot open include file: 'windows.h': No such file or directory
    306. 23>UnrealEd.cpp
    307. 23>c:\games\ro2\rag2src\rag2src\src\unrealed\inc\unrealed.h(21) : fatal error C1083: Cannot open include file: 'windows.h': No such file or directory
    308. 23>UnrealEdMisc.cpp
    309. 23>c:\games\ro2\rag2src\rag2src\src\unrealed\inc\unrealed.h(21) : fatal error C1083: Cannot open include file: 'windows.h': No such file or directory
    310. 23>UnrealEdSrv.cpp
    311. 23>c:\games\ro2\rag2src\rag2src\src\unrealed\inc\unrealed.h(21) : fatal error C1083: Cannot open include file: 'windows.h': No such file or directory
    312. 23>UnSyntax.cpp
    313. 23>c:\games\ro2\rag2src\rag2src\src\unrealed\inc\unrealed.h(21) : fatal error C1083: Cannot open include file: 'windows.h': No such file or directory
    314. 23>UnTexAlignTools.cpp
    315. 23>c:\games\ro2\rag2src\rag2src\src\unrealed\inc\unrealed.h(21) : fatal error C1083: Cannot open include file: 'windows.h': No such file or directory
    316. 23>ViewportFrame.cpp
    317. 23>c:\games\ro2\rag2src\rag2src\src\unrealed\inc\unrealed.h(21) : fatal error C1083: Cannot open include file: 'windows.h': No such file or directory
    318. 23>DlgNAPImportOption.cpp
    319. 23>c:\games\ro2\rag2src\rag2src\src\unrealed\inc\unrealed.h(21) : fatal error C1083: Cannot open include file: 'windows.h': No such file or directory
    320. 23>MonsterRegion.cpp
    321. 23>c:\games\ro2\rag2src\rag2src\src\unrealed\inc\unrealed.h(21) : fatal error C1083: Cannot open include file: 'windows.h': No such file or directory
    322. 23>NAPExport.cpp
    323. 23>c:\games\ro2\rag2src\rag2src\src\unrealed\inc\unrealed.h(21) : fatal error C1083: Cannot open include file: 'windows.h': No such file or directory
    324. 23>NAPImport.cpp
    325. 18>c:\games\ro2\rag2src\rag2src\src\engine\inc\engine.h(383) : fatal error C1083: Cannot open include file: 'EngineClasses.h': No such file or directory
    326. 18>Build log was saved at "file://c:\games\ro2\rag2src\rag2src\Output\Debug_Off\Fire\BuildLog.htm"
    327. 18>Fire - 1 error(s), 0 warning(s)
    328. 23>c:\games\ro2\rag2src\rag2src\src\unrealed\inc\unrealed.h(21) : fatal error C1083: Cannot open include file: 'windows.h': No such file or directory
    329. 23>Generating Code...
    330. 23>Build log was saved at "file://c:\games\ro2\rag2src\rag2src\Output\Debug_Off\UnrealEd\BuildLog.htm"
    331. 23>UnrealEd - 35 error(s), 0 warning(s)
    332. ========== Build: 7 succeeded, 21 failed, 0 up-to-date, 0 skipped ==========
     
    Последнее редактирование модератором: 9 янв 2015
  8. Sam3000

    Sam3000 Свой

    Регистрация:
    22.03.2009
    Сообщения:
    1.276
    Симпатии:
    297
    Баллы:
    123
    Best Answers:
    0
    Надо прописать правильные пути в "переменные среды" (в свойствах Системы).
    Для windows.h надо установить виндовый SDK. У меня например 2 таких файла в системе:
    C:\Program Files (x86)\Windows Kits\8.1\Include\um
    C:\Program Files (x86)\Microsoft SDKs\Windows\v7.1A\Include

    От вижуалки 2013 вроде бы.

    От движка unreal engine, я так понимаю что при установке он тоже в PATH пропишется и т.п.


    Надо сначала файл подгрузить и windows.h, затем посмотреть какие ошибки останутся.

    Судя по всему директХ сдк не установлен или не прописан в путях.
     
    Последнее редактирование: 17 авг 2014
  9. Sam3000

    Sam3000 Свой

    Регистрация:
    22.03.2009
    Сообщения:
    1.276
    Симпатии:
    297
    Баллы:
    123
    Best Answers:
    0
    Я вчера погуглил, поискал и потыкался. Узнал что за файлы afxwin.h и windows.h - это от MFC, входит в состав платной вижуалки. Типа про и выше.
    На экспрессе не собрать.

    Как платную установить: скачиваем с официального сайта ПРО, http://www.visualstudio.com/downloads/download-visual-studio-vs#d-professional
    Там триал период 30 дней, а потом можно будет ключ подсунуть.

    Еще люди советуют directx sdk ставить не jun2010, а поновее, хотя на сайте МС он скачивается.
    http://www.microsoft.com/en-us/download/details.aspx?id=6812
    Может новее платный... не знаю.

    До unreal engine не добрался.

    Завтра на работе установлю все и посмотрю как заработает.

    добавлено в 15:24 17.08.2014

    Есть такой же исходник, я так понимаю его тоже собрать надо.

    добавлено в 15:25 17.08.2014

    Там будет 2 файла, с 2мя переменными:
    они будут определенны как:
    поменять на (win7):
    Ссылка с инфой http://msdn.microsoft.com/en-us/library/6sehtctf.aspx
    Еще есть полный список этих масок, ссылку не сохранил.

    добавлено в 15:37 17.08.2014

    Узнал насчет directx sdk, он входит в состав windows sdk.

    добавлено в 15:39 17.08.2014

    П.С. вижуалка 2013 без проблем конвертит эти проекты.
     
    Последнее редактирование: 17 авг 2014
  10. webdes27

    webdes27 Phantom-Dev Team

    Регистрация:
    26.07.2009
    Сообщения:
    124
    Симпатии:
    48
    Баллы:
    58
    Best Answers:
    0
    Хоть у кого то получилось собрать?
     
  11. geralex

    geralex Свой

    Регистрация:
    30.03.2009
    Сообщения:
    53
    Симпатии:
    2
    Баллы:
    38
    Best Answers:
    0
    У меня ругает на недостающий файл, остальные проблемы с подготовкой я решил.


    Cannot open include file: 'EngineClasses.h': No such file or directory \src\Engine\Inc\Engine.h

    Кто-нибудь подскажите как его с генерировать?

    Нашел на китайском сайте, откуда видимо скачивали для раги, там тоже самое..

    Кто-то написал, что он генерируется самим движком Unreal Engine. Игра писалась под версию 2.5
    Есть у кого идеи по этому поводу?
     
  12. Sam3000

    Sam3000 Свой

    Регистрация:
    22.03.2009
    Сообщения:
    1.276
    Симпатии:
    297
    Баллы:
    123
    Best Answers:
    0
    Оно от двигла unreal engine, насколько я понял. Я в отпуске был, поэтому не успел найти и сказать что как. На следующей неделе запущу все это.
     
    geralex нравится это.
  13. geralex

    geralex Свой

    Регистрация:
    30.03.2009
    Сообщения:
    53
    Симпатии:
    2
    Баллы:
    38
    Best Answers:
    0
    Успехов нету? =(
     
  14. adamix

    adamix Новичек

    Регистрация:
    09.10.2014
    Сообщения:
    2
    Симпатии:
    0
    Баллы:
    1
    Best Answers:
    0
    Есть. Удалось полностью собрать исходники. К сожалению, в RO2 я не играл никогда, а исходниками занялся чисто из-за движка. Так что вопрос, у кого есть клиент RO2 года 2006-2007? Просьба выложить и дать ссылку. Если хоть что то выйдет - выложу свои сорцы.
     
  15. geralex

    geralex Свой

    Регистрация:
    30.03.2009
    Сообщения:
    53
    Симпатии:
    2
    Баллы:
    38
    Best Answers:
    0
    Как поправил?

    Cannot open include file: 'EngineClasses.h': No such file or directory \src\Engine\Inc\Engine.h

    Где сгенерировал данный файл?

    В исходах весь клиент идёт. Ты его компилируешь и всё.
     
  16. geralex

    geralex Свой

    Регистрация:
    30.03.2009
    Сообщения:
    53
    Симпатии:
    2
    Баллы:
    38
    Best Answers:
    0
    Есть ли прогресс??
     
  17. Sam3000

    Sam3000 Свой

    Регистрация:
    22.03.2009
    Сообщения:
    1.276
    Симпатии:
    297
    Баллы:
    123
    Best Answers:
    0
    Я чертовски занят работой, не до него сейчас. Думаю на новогодних праздниках я зависну на форуме.
     
  18. Sam3000

    Sam3000 Свой

    Регистрация:
    22.03.2009
    Сообщения:
    1.276
    Симпатии:
    297
    Баллы:
    123
    Best Answers:
    0
    Наконец-то удалил старые версии вижуалки, а то было 3 штуки: 2013 экспресс, 2013 про, 2012 винда 8

    Будет время свободное, настрою билд и посмотрю что сделать можно.
     
    Just нравится это.
  19. geralex

    geralex Свой

    Регистрация:
    30.03.2009
    Сообщения:
    53
    Симпатии:
    2
    Баллы:
    38
    Best Answers:
    0
    Есть у кого-нибудь?
    - Unreal Engine 2 (v.127)
    - Unreal Engine 2 (v.129)
    - Unreal Engine 2 (v.130)
    - Unreal Engine 2 (v.131)
    --- Добавлено, 29 янв 2015, Исходное сообщение было опубликовано: 11 янв 2015 ---
    Всё заглохло? Кто-нибудь смог скомпилировать проект?
     
  20. Sam3000

    Sam3000 Свой

    Регистрация:
    22.03.2009
    Сообщения:
    1.276
    Симпатии:
    297
    Баллы:
    123
    Best Answers:
    0
    У меня времени не было, займусь в следующем месяце, сейчас не до него.
     
Проверка:
Черновик сохранён Черновик удалён
Загрузка...
Похожие топики
  1. Мяфк
    Ответов:
    7
    Просмотров:
    1.272
  2. Just
    Ответов:
    26
    Просмотров:
    5.031
  3. Just
    Ответов:
    1
    Просмотров:
    1.451
  4. UniHorn
    Ответов:
    1
    Просмотров:
    1.821
  5. Just
    Ответов:
    1
    Просмотров:
    1.343

Поделиться этой страницей